Target
Tyrosine-protein kinase ITK/TSK
Ligand
BDBM50015263
Substrate
Meas. Tech.
ChEMBL_1349759 (CHEMBL3267591)
Ki
0.560000±n/a nM
Citation
 Pastor, RMBurch, JDMagnuson, SOrtwine, DFChen, YDe La Torre, KDing, XEigenbrot, CJohnson, ALiimatta, MLiu, YShia, SWang, XWu, LCPei, Z Discovery and optimization of indazoles as potent and selective interleukin-2 inducible T cell kinase (ITK) inhibitors. Bioorg Med Chem Lett 24:2448-52 (2014)  
Target
Name:
Tyrosine-protein kinase ITK/TSK
Synonyms:
EMT ITK_HUMAN LYK Tyrosine-protein kinase ITK Tyrosine-protein kinase Lyk
Type:
Protein
Mol. Mass.:
71839.20
Organism:
Homo sapiens (Human)
Description:
Q08881
Residue:
620
  
Inhibitor
Name:
BDBM50015263
Synonyms:
CHEMBL3263050
Type:
Small organic molecule
Emp. Form.:
C22H19N7O2
Mol. Mass.:
413.432
SMILES:
OC[C@@H](c1ccccc1)n1cc(NC(=O)c2n[nH]c3cc(ccc23)-c2cn[nH]c2)cn1
: