Target
Carboxylic ester hydrolase
Ligand
BDBM50016875
Substrate
Meas. Tech.
ChEMBL_1355055 (CHEMBL3280469)
Ki
11±n/a nM
Citation
 Chen, WSCocolas, GHCavallito, CJChai, KJ Potent reversible anticholinesterase agents. Bis- and mono-N-substituted benzoquinolinium halides. J Med Chem 20:1617-23 (1978)  
Target
Name:
Carboxylic ester hydrolase
Synonyms:
BuChE Butyrylcholine esterase Butyrylcholinesterase (BChE) Butyrylcholinesterase (EqBuChE) butyrylcholinesterase precursor
Type:
Protein
Mol. Mass.:
68842.83
Organism:
Equus caballus (Horse)
Description:
Q9N1N9
Residue:
602
  
Inhibitor
Name:
BDBM50016875
Synonyms:
CHEMBL3276431
Type:
Small organic molecule
Emp. Form.:
C17H16BrNO2
Mol. Mass.:
346.218
SMILES:
[Br-].CC(=O)OCC[n+]1c2ccccc2cc2ccccc12
: