Target
Amine oxidase [flavin-containing] A
Ligand
BDBM50017512
Substrate
Meas. Tech.
ChEMBL_1363618 (CHEMBL3292881)
IC50
1160±n/a nM
Citation
 Legoabe, LJPetzer, APetzer, JP a-Tetralone derivatives as inhibitors of monoamine oxidase. Bioorg Med Chem Lett 24:2758-63 (2014)  
Target
Name:
Amine oxidase [flavin-containing] A
Synonyms:
AOFA_HUMAN MAO-A Monoamine oxidase Monoamine oxidase type A (MAO A) Monoamine oxidase type A (MAOA)
Type:
Protein
Mol. Mass.:
59689.53
Organism:
Homo sapiens (Human)
Description:
P21397
Residue:
527
  
Inhibitor
Name:
BDBM50017512
Synonyms:
CHEMBL3288305
Type:
Small organic molecule
Emp. Form.:
C19H20O2
Mol. Mass.:
280.3609
SMILES:
O=C1CCCc2cc(OCCCc3ccccc3)ccc12
: