Target
Metabotropic glutamate receptor 3
Ligand
BDBM50017663
Substrate
Meas. Tech.
ChEMBL_1364013 (CHEMBL3295852)
IC50
78±n/a nM
Citation
 Wenthur, CJMorrison, RDDaniels, JSConn, PJLindsley, CW Synthesis and SAR of substituted pyrazolo[1,5-a]quinazolines as dual mGlu(2)/mGlu(3) NAMs. Bioorg Med Chem Lett 24:2693-8 (2014)  
Target
Name:
Metabotropic glutamate receptor 3
Synonyms:
GRM3_RAT Grm3 glutamate receptor, metabotropic 3 precursor
Type:
Protein
Mol. Mass.:
98971.84
Organism:
Rattus norvegicus (Rat)
Description:
P31422
Residue:
879
  
Inhibitor
Name:
BDBM50017663
Synonyms:
CHEMBL3288676
Type:
Small organic molecule
Emp. Form.:
C21H15N5O
Mol. Mass.:
353.3767
SMILES:
Cn1c2cc(nn2c2cc(ccc2c1=O)-c1cncnc1)-c1ccccc1
: