Target
Dihydroorotate dehydrogenase (quinone), mitochondrial
Ligand
BDBM50018008
Substrate
Meas. Tech.
ChEMBL_1366447 (CHEMBL3296347)
IC50
2100±n/a nM
Citation
 Deng, XKokkonda, SEl Mazouni, FWhite, JBurrows, JNKaminsky, WCharman, SAMatthews, DRathod, PKPhillips, MA Fluorine modulates species selectivity in the triazolopyrimidine class of Plasmodium falciparum dihydroorotate dehydrogenase inhibitors. J Med Chem 57:5381-94 (2014)  
Target
Name:
Dihydroorotate dehydrogenase (quinone), mitochondrial
Synonyms:
DHODH Dihydroorotate dehydrogenase Dihydroorotate dehydrogenase, mitochondrial Dihydroorotate oxidase (DHODH) | PYRD_HUMAN
Type:
Enzyme
Mol. Mass.:
42881.33
Organism:
Homo sapiens (Human)
Description:
Q02127
Residue:
395
  
Inhibitor
Name:
BDBM50018008
Synonyms:
CHEMBL3289671 | US9238653, Table 5, Compound 43
Type:
Small organic molecule
Emp. Form.:
C15H10F7N5
Mol. Mass.:
393.2622
SMILES:
Cc1cc(Nc2cc(F)c(c(F)c2)C(F)(F)F)n2nc(nc2n1)C(C)(F)F
: