Target
Dihydroorotate dehydrogenase (quinone), mitochondrial
Ligand
BDBM50018007
Substrate
Meas. Tech.
ChEMBL_1366448 (CHEMBL3296348)
IC50
800±n/a nM
Citation
 Deng, XKokkonda, SEl Mazouni, FWhite, JBurrows, JNKaminsky, WCharman, SAMatthews, DRathod, PKPhillips, MA Fluorine modulates species selectivity in the triazolopyrimidine class of Plasmodium falciparum dihydroorotate dehydrogenase inhibitors. J Med Chem 57:5381-94 (2014)  
Target
Name:
Dihydroorotate dehydrogenase (quinone), mitochondrial
Synonyms:
DHOdehase Dihydroorotate Dehydrogenase (DHODH) Dihydroorotate oxidase | PYRD_RAT
Type:
Enzyme
Mol. Mass.:
42672.97
Organism:
Rattus norvegicus (rat)
Description:
The enzyme assay was performed with the histidine-tagged enzyme without cleavage of the tag.
Residue:
395
  
Inhibitor
Name:
BDBM50018007
Synonyms:
CHEMBL3289670 | US9238653, Table 5, Compound 42
Type:
Small organic molecule
Emp. Form.:
C15H11F6N5
Mol. Mass.:
375.2718
SMILES:
Cc1cc(Nc2ccc(c(F)c2)C(F)(F)F)n2nc(nc2n1)C(C)(F)F
: