Target
Dihydroorotate dehydrogenase (quinone), mitochondrial
Ligand
BDBM50365225
Substrate
Meas. Tech.
ChEMBL_1366444 (CHEMBL3296344)
IC50
9700±n/a nM
Citation
 Deng, XKokkonda, SEl Mazouni, FWhite, JBurrows, JNKaminsky, WCharman, SAMatthews, DRathod, PKPhillips, MA Fluorine modulates species selectivity in the triazolopyrimidine class of Plasmodium falciparum dihydroorotate dehydrogenase inhibitors. J Med Chem 57:5381-94 (2014)  
Target
Name:
Dihydroorotate dehydrogenase (quinone), mitochondrial
Synonyms:
Dhodh PYRD_MOUSE
Type:
PROTEIN
Mol. Mass.:
42711.08
Organism:
Mus musculus
Description:
ChEMBL_1366444
Residue:
395
  
Inhibitor
Name:
BDBM50365225
Synonyms:
CHEMBL1956290 | US9238653, Table 5, Compound 14
Type:
Small organic molecule
Emp. Form.:
C14H9F6N5
Mol. Mass.:
361.2452
SMILES:
Cc1cc(Nc2ccc(cc2)C(F)(F)F)n2nc(nc2n1)C(F)(F)F
: