Target
Beta-2 adrenergic receptor
Ligand
BDBM50018587
Substrate
Meas. Tech.
ChEMBL_1362122 (CHEMBL3294894)
EC50
2.0±n/a nM
Citation
 Jacobsen, JRAggen, JBChurch, TJKlein, UPfeiffer, JWPulido-Rios, TMThomas, GRYu, CMoran, EJ Multivalent design of long-actingß(2)-adrenoceptor agonists incorporating biarylamines. Bioorg Med Chem Lett 24:2625-30 (2014)  
Target
Name:
Beta-2 adrenergic receptor
Synonyms:
ADRB2_CAVPO adrenergic Beta2
Type:
Enzyme Catalytic Domain
Mol. Mass.:
46993.24
Organism:
GUINEA PIG
Description:
adrenergic Beta2 ADRB2 GUINEA PIG::Q8K4Z4
Residue:
418
  
Inhibitor
Name:
BDBM50018587
Synonyms:
CHEMBL3290997
Type:
Small organic molecule
Emp. Form.:
C30H32N2O4
Mol. Mass.:
484.5861
SMILES:
COc1ccc(Nc2ccc(CCNC[C@H](O)c3ccc(O)c(CO)c3)cc2)cc1-c1ccccc1
: