Target
Beta-1 adrenergic receptor
Ligand
BDBM50018608
Substrate
Meas. Tech.
ChEMBL_1362119 (CHEMBL3294891)
Ki
19953±n/a nM
Citation
 Jacobsen, JRAggen, JBChurch, TJKlein, UPfeiffer, JWPulido-Rios, TMThomas, GRYu, CMoran, EJ Multivalent design of long-actingß(2)-adrenoceptor agonists incorporating biarylamines. Bioorg Med Chem Lett 24:2625-30 (2014)  
Target
Name:
Beta-1 adrenergic receptor
Synonyms:
ADRB1 ADRB1_HUMAN Beta-1 adrenoceptor adrenergic Beta1
Type:
G Protein-Coupled Receptor (GPCR)
Mol. Mass.:
51338.40
Organism:
Homo sapiens (Human)
Description:
P08588
Residue:
477
  
Inhibitor
Name:
BDBM50018608
Synonyms:
CHEMBL3290989
Type:
Small organic molecule
Emp. Form.:
C30H32N2O4
Mol. Mass.:
484.5861
SMILES:
COc1ccc(Nc2ccc(CCNCC(O)c3ccc(O)c(CO)c3)cc2)cc1-c1ccccc1
: