Target
Tyrosine-protein kinase ITK/TSK
Ligand
BDBM50019897
Substrate
Meas. Tech.
ChEMBL_1361886 (CHEMBL3293061)
Ki
0.300000±n/a nM
Citation
 Abdel-Magid, AF Treatment of Immunological or Inflammatory Disorders with ITK Kinase Inhibitors. ACS Med Chem Lett 5:456-7 (2014)  
Target
Name:
Tyrosine-protein kinase ITK/TSK
Synonyms:
EMT ITK_HUMAN LYK Tyrosine-protein kinase ITK Tyrosine-protein kinase Lyk
Type:
Protein
Mol. Mass.:
71839.20
Organism:
Homo sapiens (Human)
Description:
Q08881
Residue:
620
  
Inhibitor
Name:
BDBM50019897
Synonyms:
CHEMBL3287196
Type:
Small organic molecule
Emp. Form.:
C25H31FN6O
Mol. Mass.:
450.5516
SMILES:
CC1(C)CCc2c(C1)[nH]nc2C(=O)Nc1cnn(c1)C(C1CN(CCF)C1)c1ccccc1
: