Target
Substance-P receptor
Ligand
BDBM50020118
Substrate
Meas. Tech.
ChEMBL_1364155 (CHEMBL3292632)
Ki
32±n/a nM
Citation
 Hanessian, SJennequin, TBoyer, NBabonneau, VSoma, UMannoury la Cour, CMillan, MJDe Nanteuil, G Design, Synthesis, and Optimization of Balanced Dual NK1/NK3 Receptor Antagonists. ACS Med Chem Lett 5:550-5 (2014)  
Target
Name:
Substance-P receptor
Synonyms:
NK-1 receptor NK1 Receptor NK1R_HUMAN Neurokinin-1 (NK-1) SPR TACR1 Tachykinin receptor 1 (NK1) | tachykinin
Type:
G Protein-Coupled Receptor (GPCR)
Mol. Mass.:
46254.43
Organism:
Homo sapiens (Human)
Description:
P25103
Residue:
407
  
Inhibitor
Name:
BDBM50020118
Synonyms:
CHEMBL3288167
Type:
Small organic molecule
Emp. Form.:
C35H39Cl2FN4O5
Mol. Mass.:
685.612
SMILES:
CN1C(=O)OC2(CCN(CC[C@@](C)(C(=O)N[C@H](Cc3ccccc3)C(=O)NCCO)c3ccc(Cl)c(Cl)c3)CC2)c2cc(F)ccc12
: