Target
Substance-P receptor
Ligand
BDBM50020127
Substrate
Meas. Tech.
ChEMBL_1364155 (CHEMBL3292632)
Ki
4.0±n/a nM
Citation
 Hanessian, SJennequin, TBoyer, NBabonneau, VSoma, UMannoury la Cour, CMillan, MJDe Nanteuil, G Design, Synthesis, and Optimization of Balanced Dual NK1/NK3 Receptor Antagonists. ACS Med Chem Lett 5:550-5 (2014)  
Target
Name:
Substance-P receptor
Synonyms:
NK-1 receptor NK1 Receptor NK1R_HUMAN Neurokinin-1 (NK-1) SPR TACR1 Tachykinin receptor 1 (NK1) | tachykinin
Type:
G Protein-Coupled Receptor (GPCR)
Mol. Mass.:
46254.43
Organism:
Homo sapiens (Human)
Description:
P25103
Residue:
407
  
Inhibitor
Name:
BDBM50020127
Synonyms:
CHEMBL3288170
Type:
Small organic molecule
Emp. Form.:
C39H45Cl2F4N5O6
Mol. Mass.:
826.704
SMILES:
OC(=O)C(F)(F)F.CN([C@H](Cc1ccccc1)C(=O)NCCCN)C(=O)[C@](C)(CCN1CCC2(CC1)OC(=O)N(C)c1ccc(F)cc21)c1ccc(Cl)c(Cl)c1
: