Target
Neuromedin-K receptor
Ligand
BDBM50020120
Substrate
Meas. Tech.
ChEMBL_1364156 (CHEMBL3292633)
Ki
7.9±n/a nM
Citation
 Hanessian, SJennequin, TBoyer, NBabonneau, VSoma, UMannoury la Cour, CMillan, MJDe Nanteuil, G Design, Synthesis, and Optimization of Balanced Dual NK1/NK3 Receptor Antagonists. ACS Med Chem Lett 5:550-5 (2014)  
Target
Name:
Neuromedin-K receptor
Synonyms:
NK-3 receptor NK3R NKR Neurokinin B receptor Neuromedin-3 receptor (NK-3R) Neuromedin-K receptor Neuromedin-K receptor (NK3) TAC3R Tachykinin receptor 3 | Tachykinin receptor 3 (NK3)
Type:
Enzyme
Mol. Mass.:
52221.96
Organism:
Homo sapiens (Human)
Description:
P29371
Residue:
465
  
Inhibitor
Name:
BDBM50020120
Synonyms:
CHEMBL3288169
Type:
Small organic molecule
Emp. Form.:
C38H43Cl2F4N5O6
Mol. Mass.:
812.678
SMILES:
OC(=O)C(F)(F)F.CN([C@H](Cc1ccccc1)C(=O)NCCN)C(=O)[C@](C)(CCN1CCC2(CC1)OC(=O)N(C)c1ccc(F)cc21)c1ccc(Cl)c(Cl)c1
: