Target
Chloroquine resistance transporter
Ligand
BDBM50020159
Substrate
Meas. Tech.
ChEMBL_1364181 (CHEMBL3292896)
IC50
66000±n/a nM
Citation
 Deane, KJSummers, RLLehane, AMMartin, REBarrow, RA Chlorpheniramine Analogues Reverse Chloroquine Resistance in Plasmodium falciparum by Inhibiting PfCRT. ACS Med Chem Lett 5:576-81 (2014)  
Target
Name:
Chloroquine resistance transporter
Synonyms:
CRT PfCRT
Type:
PROTEIN
Mol. Mass.:
48687.29
Organism:
Plasmodium falciparum
Description:
ChEMBL_1364181
Residue:
424
  
Inhibitor
Name:
BDBM50020159
Synonyms:
CHEMBL3286418
Type:
Small organic molecule
Emp. Form.:
C17H21ClN2
Mol. Mass.:
288.815
SMILES:
CN(C)CCCC(c1cccc(Cl)c1)c1ccccn1
: