Target
Interleukin-2
Ligand
BDBM50021399
Substrate
Meas. Tech.
ChEMBL_1363478 (CHEMBL3291700)
Kd
55±n/a nM
Citation
 Chen, LDu, JDai, QZhang, HPang, WHu, J Prediction of anti-tumor chemical probes of a traditional Chinese medicine formula by HPLC fingerprinting combined with molecular docking. Eur J Med Chem 83:294-306 (2014)  
Target
Name:
Interleukin-2
Synonyms:
IL-2 IL2_HUMAN Interleukin-2 T-cell growth factor | TCGF
Type:
Enzyme
Mol. Mass.:
17630.05
Organism:
Homo sapiens (Human)
Description:
P60568
Residue:
153
  
Inhibitor
Name:
BDBM50021399
Synonyms:
CHEMBL3289611
Type:
Small organic molecule
Emp. Form.:
C25H33Cl2N7O2
Mol. Mass.:
534.481
SMILES:
NC(=N)NC(C1CCCCC1)C(=O)NCC(=O)N1CCC(CC1)c1cc(n[nH]1)-c1cccc(Cl)c1Cl
: