Target
Monoglyceride lipase
Ligand
BDBM50414921
Substrate
Meas. Tech.
ChEMBL_1367201
IC50
26±n/a nM
Citation
 Tuccinardi, TGranchi, CRizzolio, FCaligiuri, IBattistello, VToffoli, GMinutolo, FMacchia, MMartinelli, A Identification and characterization of a new reversible MAGL inhibitor. Bioorg Med Chem 22:3285-91 (2014)  
Target
Name:
Monoglyceride lipase
Synonyms:
HU-K5 Lysophospholipase-like MGL MGLL_HUMAN
Type:
Hydrolase
Mol. Mass.:
33264.56
Organism:
Homo sapiens (Human)
Description:
Human recombinant MGL (Cayman Chemical, cat# 10008354).
Residue:
303
  
Inhibitor
Name:
BDBM50414921
Synonyms:
CHEMBL570812
Type:
Small organic molecule
Emp. Form.:
C18H17N3O5
Mol. Mass.:
355.3447
SMILES:
COc1nn(-c2ccc(NC(=O)OCc3ccccc3)c(C)c2)c(=O)o1
: