Target
Alpha-1D adrenergic receptor
Ligand
BDBM50023188
Substrate
Meas. Tech.
ChEMBL_1368301 (CHEMBL3299606)
Ki
0.141254±n/a nM
Citation
 Romeo, GSalerno, LPittalą, VModica, MNSiracusa, MAMateria, LBuccioni, MMarucci, GMinneman, KP High affinity ligands and potent antagonists for thea1D-adrenergic receptor. Novel 3,8-disubstituted [1]benzothieno[3,2-d]pyrimidine derivatives. Eur J Med Chem 83:419-32 (2014)  
Target
Name:
Alpha-1D adrenergic receptor
Synonyms:
ADA1D_HUMAN ADRA1D Adrenergic receptor alpha Alpha 1D-adrenoreceptor Alpha-1D adrenoceptor adrenergic Alpha1D
Type:
Enzyme Catalytic Domain
Mol. Mass.:
60485.82
Organism:
Homo sapiens (Human)
Description:
adrenergic Alpha1D ADRA1D HUMAN::P25100
Residue:
572
  
Inhibitor
Name:
BDBM50023188
Synonyms:
CHEMBL3298750
Type:
Small organic molecule
Emp. Form.:
C35H38N6O5S
Mol. Mass.:
654.778
SMILES:
COc1ccccc1N1CCN(CCn2c(=O)[nH]c3c4cc(NC(=O)CCCC(=O)NCc5ccccc5)ccc4sc3c2=O)CC1
: