Target
Aldo-keto reductase family 1 member B1
Ligand
BDBM50023457
Substrate
Meas. Tech.
ChEMBL_1452475 (CHEMBL3362499)
IC50
147300±n/a nM
Citation
 Fatmawati, SErsam, TYu, HZhang, CJin, FShimizu, K 20(S)-Ginsenoside Rh2 as aldose reductase inhibitor from Panax ginseng. Bioorg Med Chem Lett 24:4407-9 (2014)  
Target
Name:
Aldo-keto reductase family 1 member B1
Synonyms:
AKR1B1 ALDR_HUMAN AR Aldose Reductase (ALR2) Aldose reductase (AR)
Type:
Protein
Mol. Mass.:
35855.50
Organism:
Homo sapiens (Human)
Description:
P15121. 4LAU; 2IKI; 4LB4; 2FZD; 2FZ8; 1US0
Residue:
316
  
Inhibitor
Name:
BDBM50023457
Synonyms:
20(S)-Ginsenoside Ginsenoside Rh2
Type:
Small organic molecule
Emp. Form.:
C36H62O8
Mol. Mass.:
622.8727
SMILES:
[H][C@@]1([#6]-[#6][C@]2([#6])[C@]1([H])[#6@H](-[#8])-[#6][C@]1([H])[C@@]3([#6])[#6]-[#6]-[#6@H](-[#8][C@]4([H])[#8]-[#6@H](-[#6]-[#8])-[#6@@H](-[#8])-[#6@H](-[#8])-[#6@H]4-[#8])C([#6])([#6])[C@]3([H])[#6]-[#6][C@@]21[#6])[C@@]([#6])([#8])[#6]-[#6]\[#6]=[#6](\[#6])-[#6]
: