Target
Cholinesterase
Ligand
BDBM50024890
Substrate
Meas. Tech.
ChEMBL_1439642 (CHEMBL3383712)
IC50
>40000±n/a nM
Citation
 Gulcan, HOUnlu, SEsiringu, IErcetin, TSahin, YOz, DSahin, MF Design, synthesis and biological evaluation of novel 6H-benzo[c]chromen-6-one, and 7,8,9,10-tetrahydro-benzo[c]chromen-6-one derivatives as potential cholinesterase inhibitors. Bioorg Med Chem 22:5141-54 (2014)  
Target
Name:
Cholinesterase
Synonyms:
Acylcholine acylhydrolase Butyrylcholine esterase (BChE) Butyrylcholinesterase (BuChE) CHLE_HUMAN Cholinesterases Pseudocholinesterase
Type:
Homotetramer
Mol. Mass.:
68422.27
Organism:
Homo sapiens (Human)
Description:
P06276
Residue:
602
  
Inhibitor
Name:
BDBM50024890
Synonyms:
CHEMBL3335051
Type:
Small organic molecule
Emp. Form.:
C26H31NO4
Mol. Mass.:
421.5286
SMILES:
COc1cccc(CN(C)CCCCOc2ccc3c4CCCCc4c(=O)oc3c2)c1
: