Target
ALK tyrosine kinase receptor
Ligand
BDBM50025774
Substrate
Meas. Tech.
ChEMBL_1436034 (CHEMBL3383505)
IC50
178±n/a nM
Citation
 Liu, ZYue, XSong, ZPeng, XGuo, JJi, YCheng, ZDing, JAi, JGeng, MZhang, A Design, synthesis and pharmacological evaluation of 2-(thiazol-2-amino)-4-arylaminopyrimidines as potent anaplastic lymphoma kinase (ALK) inhibitors. Eur J Med Chem 86:438-48 (2014)  
Target
Name:
ALK tyrosine kinase receptor
Synonyms:
ALK ALK_HUMAN CD_antigen: CD246
Type:
Protein
Mol. Mass.:
176453.10
Organism:
Homo sapiens (Human)
Description:
Q9UM73
Residue:
1620
  
Inhibitor
Name:
BDBM50025774
Synonyms:
CHEMBL3330855
Type:
Small organic molecule
Emp. Form.:
C23H27ClN6O4S2
Mol. Mass.:
551.081
SMILES:
CCOC(=O)N1CCc2nc(Nc3ncc(Cl)c(Nc4ccccc4S(=O)(=O)C(C)C)n3)sc2CC1
: