Target
Gamma-butyrobetaine dioxygenase
Ligand
BDBM50028968
Substrate
Meas. Tech.
ChEMBL_1434106 (CHEMBL3382784)
IC50
3200±n/a nM
Citation
 Rydzik, AMBrem, JStruwe, WBKochan, GTBenesch, JLSchofield, CJ Ejection of structural zinc leads to inhibition of¿-butyrobetaine hydroxylase. Bioorg Med Chem Lett 24:4954-7 (2014)  
Target
Name:
Gamma-butyrobetaine dioxygenase
Synonyms:
BBH BBOX1 Gamma-BBH Gamma-butyrobetaine,2-oxoglutarate dioxygenase
Type:
PROTEIN
Mol. Mass.:
44715.93
Organism:
Homo sapiens (Human)
Description:
ChEMBL_1434107
Residue:
387
  
Inhibitor
Name:
BDBM50028968
Synonyms:
CHEMBL3335712
Type:
Small organic molecule
Emp. Form.:
C6H5ClSe
Mol. Mass.:
191.52
SMILES:
Cl[Se]c1ccccc1
: