Target
Gamma-butyrobetaine dioxygenase
Ligand
BDBM50028969
Substrate
Meas. Tech.
ChEMBL_1434775 (CHEMBL3383444)
Kd
>200000±n/a nM
Citation
 Rydzik, AMBrem, JStruwe, WBKochan, GTBenesch, JLSchofield, CJ Ejection of structural zinc leads to inhibition of¿-butyrobetaine hydroxylase. Bioorg Med Chem Lett 24:4954-7 (2014)  
Target
Name:
Gamma-butyrobetaine dioxygenase
Synonyms:
BBH BBOX1 Gamma-BBH Gamma-butyrobetaine,2-oxoglutarate dioxygenase
Type:
PROTEIN
Mol. Mass.:
44715.93
Organism:
Homo sapiens (Human)
Description:
ChEMBL_1434107
Residue:
387
  
Inhibitor
Name:
BDBM50028969
Synonyms:
CHEMBL3122204
Type:
Small organic molecule
Emp. Form.:
C12H10Se2
Mol. Mass.:
312.13
SMILES:
[Se]([Se]c1ccccc1)c1ccccc1
: