Target
Gamma-butyrobetaine dioxygenase
Ligand
BDBM43362
Substrate
Meas. Tech.
ChEMBL_1434775 (CHEMBL3383444)
Kd
35000±n/a nM
Citation
 Rydzik, AMBrem, JStruwe, WBKochan, GTBenesch, JLSchofield, CJ Ejection of structural zinc leads to inhibition of¿-butyrobetaine hydroxylase. Bioorg Med Chem Lett 24:4954-7 (2014)  
Target
Name:
Gamma-butyrobetaine dioxygenase
Synonyms:
BBH BBOX1 Gamma-BBH Gamma-butyrobetaine,2-oxoglutarate dioxygenase
Type:
PROTEIN
Mol. Mass.:
44715.93
Organism:
Homo sapiens (Human)
Description:
ChEMBL_1434107
Residue:
387
  
Inhibitor
Name:
BDBM43362
Synonyms:
MLS000069752 N,N-dimethylcarbamodithioic acid [[dimethylamino(sulfanylidene)methyl]thio] ester TETRAMETHYLTHIURAM DISULFIDE dimethylcarbamothioylsulfanyl N,N-dimethylcarbamodithioate
Type:
Small organic molecule
Emp. Form.:
C6H12N2S4
Mol. Mass.:
240.433
SMILES:
CN(C)C(=S)SSC(=S)N(C)C
: