Target
NAD-dependent protein deacetylase sirtuin-3, mitochondrial
Ligand
BDBM50030172
Substrate
Meas. Tech.
ChEMBL_1438398 (CHEMBL3383627)
IC50
27900±n/a nM
Citation
 Cui, HKamal, ZAi, TXu, YMore, SSWilson, DJChen, L Discovery of potent and selective sirtuin 2 (SIRT2) inhibitors using a fragment-based approach. J Med Chem 57:8340-57 (2014)  
Target
Name:
NAD-dependent protein deacetylase sirtuin-3, mitochondrial
Synonyms:
NAD-dependent deacetylase sirtuin 3 SIR2L3 SIRT3
Type:
Protein
Mol. Mass.:
43582.69
Organism:
Homo sapiens (Human)
Description:
Q9NTG7
Residue:
399
  
Inhibitor
Name:
BDBM50030172
Synonyms:
CHEMBL3343526
Type:
Small organic molecule
Emp. Form.:
C16H12N2OS
Mol. Mass.:
280.344
SMILES:
NC(=O)c1cncc(Sc2ccc3ccccc3c2)c1
: