Target
NAD-dependent protein deacetylase sirtuin-2
Ligand
BDBM50030172
Substrate
Meas. Tech.
ChEMBL_1438397 (CHEMBL3383626)
IC50
12100±n/a nM
Citation
 Cui, HKamal, ZAi, TXu, YMore, SSWilson, DJChen, L Discovery of potent and selective sirtuin 2 (SIRT2) inhibitors using a fragment-based approach. J Med Chem 57:8340-57 (2014)  
Target
Name:
NAD-dependent protein deacetylase sirtuin-2
Synonyms:
NAD-Dependent Deacetylase Sirtuin-2 NAD-dependent deacetylase sirtuin 3 SIR2-like SIR2L SIR2_HUMAN Sirtuin 2 (SIRT2)
Type:
Hydrolase
Mol. Mass.:
43172.62
Organism:
Homo sapiens (Human)
Description:
Residue:
389
  
Inhibitor
Name:
BDBM50030172
Synonyms:
CHEMBL3343526
Type:
Small organic molecule
Emp. Form.:
C16H12N2OS
Mol. Mass.:
280.344
SMILES:
NC(=O)c1cncc(Sc2ccc3ccccc3c2)c1
: