Target
Coagulation factor XI
Ligand
BDBM50032864
Substrate
Meas. Tech.
ChEMBL_1443463 (CHEMBL3377177)
Ki
800±n/a nM
Citation
 Hangeland, JJFriends, TJRossi, KASmallheer, JMWang, CSun, ZCorte, JRFang, TWong, PCRendina, ARBarbera, FABozarth, JMLuettgen, JMWatson, CAZhang, GWei, ARamamurthy, VMorin, PEBisacchi, GSSubramaniam, SArunachalam, PMathur, ASeiffert, DAWexler, RRQuan, ML Phenylimidazoles as potent and selective inhibitors of coagulation factor XIa with in vivo antithrombotic activity. J Med Chem 57:9915-32 (2014)  
Target
Name:
Coagulation factor XI
Synonyms:
Coagulation factor XIa Coagulation factor XIa light chain FA11_HUMAN Factor XIa PTA | Plasma thromboplastin antecedent
Type:
Enzyme
Mol. Mass.:
70130.58
Organism:
Homo sapiens (Human)
Description:
P03951
Residue:
625
  
Inhibitor
Name:
BDBM50032864
Synonyms:
CHEMBL3355666
Type:
Small organic molecule
Emp. Form.:
C29H33F3N4O5
Mol. Mass.:
574.5913
SMILES:
OC(=O)C(F)(F)F.COC(=O)c1ccc(cc1)-c1c[nH]c(n1)[C@H](Cc1ccccc1)NC(=O)[C@H]1CC[C@H](CN)CC1
: