Target
Coagulation factor X
Ligand
BDBM50032864
Substrate
Meas. Tech.
ChEMBL_1443465 (CHEMBL3377179)
Ki
>8180±n/a nM
Citation
 Hangeland, JJFriends, TJRossi, KASmallheer, JMWang, CSun, ZCorte, JRFang, TWong, PCRendina, ARBarbera, FABozarth, JMLuettgen, JMWatson, CAZhang, GWei, ARamamurthy, VMorin, PEBisacchi, GSSubramaniam, SArunachalam, PMathur, ASeiffert, DAWexler, RRQuan, ML Phenylimidazoles as potent and selective inhibitors of coagulation factor XIa with in vivo antithrombotic activity. J Med Chem 57:9915-32 (2014)  
Target
Name:
Coagulation factor X
Synonyms:
Activated coagulation factor X (FXa) Coagulation factor X precursor F10 Factor X heavy chain Factor Xa Stuart-Prower factor
Type:
Enzyme
Mol. Mass.:
54726.60
Organism:
Homo sapiens (Human)
Description:
Residue:
488
  
Inhibitor
Name:
BDBM50032864
Synonyms:
CHEMBL3355666
Type:
Small organic molecule
Emp. Form.:
C29H33F3N4O5
Mol. Mass.:
574.5913
SMILES:
OC(=O)C(F)(F)F.COC(=O)c1ccc(cc1)-c1c[nH]c(n1)[C@H](Cc1ccccc1)NC(=O)[C@H]1CC[C@H](CN)CC1
: