Target
Kappa-type opioid receptor
Ligand
BDBM50034552
Substrate
Meas. Tech.
ChEMBL_1438728 (CHEMBL3388550)
EC50
890±n/a nM
Citation
 Riley, APGroer, CEYoung, DEwald, AWKivell, BMPrisinzano, TE Synthesis and¿-opioid receptor activity of furan-substituted salvinorin A analogues. J Med Chem 57:10464-75 (2014)  
Target
Name:
Kappa-type opioid receptor
Synonyms:
K-OR-1 Kappa-opioid receptor (KOR) Kappa-type opioid receptor (KOR) OPIATE Kappa OPRK1 kappa opioid receptor (KOR)
Type:
G Protein-Coupled Receptor (GPCR)
Mol. Mass.:
42648.76
Organism:
Homo sapiens (Human)
Description:
P41145
Residue:
380
  
Inhibitor
Name:
BDBM50034552
Synonyms:
CHEMBL3359803
Type:
Small organic molecule
Emp. Form.:
C28H34O9
Mol. Mass.:
514.5642
SMILES:
[H][C@@]12CC[C@@]3(C)[C@@H](C[C@H](OC(C)=O)C(=O)[C@]3([H])[C@@]1(C)C[C@H](OC2=O)c1ccoc1C#CCCCO)C(=O)OC
: