Target
cAMP and cAMP-inhibited cGMP 3',5'-cyclic phosphodiesterase 10A
Ligand
BDBM98891
Substrate
Meas. Tech.
ChEMBL_1437292 (CHEMBL3384795)
IC50
2.4±n/a nM
Citation
 Rzasa, RMFrohn, MJAndrews, KLChmait, SChen, NClarine, JGDavis, CEastwood, HAHorne, DBHu, EJones, ADKaller, MRKunz, RKMiller, SMonenschein, HNguyen, TPickrell, AJPorter, AReichelt, AZhao, XTreanor, JJAllen, JR Synthesis and preliminary biological evaluation of potent and selective 2-(3-alkoxy-1-azetidinyl) quinolines as novel PDE10A inhibitors with improved solubility. Bioorg Med Chem 22:6570-85 (2015)  
Target
Name:
cAMP and cAMP-inhibited cGMP 3',5'-cyclic phosphodiesterase 10A
Synonyms:
3',5'-cyclic phosphodiesterase PDE10A Phosphodiesterase 10 (PDE10) | Phosphodiesterase 10A
Type:
Protein
Mol. Mass.:
88412.52
Organism:
Homo sapiens (Human)
Description:
Q9Y233
Residue:
1055
  
Inhibitor
Name:
BDBM98891
Synonyms:
US8497265, 217 | US8497265, 239
Type:
Small organic molecule
Emp. Form.:
C22H25N5O2
Mol. Mass.:
391.4662
SMILES:
OCC1CCN(CC1)c1nccnc1OC1CN(C1)c1ccc2ccccc2n1
: