Target
Kinesin-like protein KIFC1
Ligand
BDBM50037901
Substrate
Meas. Tech.
ChEMBL_1438848 (CHEMBL3390316)
IC50
>100000±n/a nM
Citation
 Yang, BLamb, MLZhang, THennessy, EJGrewal, GSha, LZambrowski, MBlock, MHDowling, JESu, NWu, JDeegan, TMikule, KWang, WKaspera, RChuaqui, CChen, H Discovery of potent KIFC1 inhibitors using a method of integrated high-throughput synthesis and screening. J Med Chem 57:9958-70 (2014)  
Target
Name:
Kinesin-like protein KIFC1
Synonyms:
HSET KIFC1 KNSL2 Kinesin-like protein KIFC1 | Kinesin-related protein HSET
Type:
PROTEIN
Mol. Mass.:
73763.89
Organism:
Homo sapiens (Human)
Description:
ChEMBL_109524
Residue:
673
  
Inhibitor
Name:
BDBM50037901
Synonyms:
CHEMBL3358253
Type:
Small organic molecule
Emp. Form.:
C32H34F3N5O3
Mol. Mass.:
593.6393
SMILES:
CN(C)CCNC(=O)C(Cc1ccc(cc1)-c1cc(nn1C)C(F)(F)F)NC(=O)c1ccccc1OCc1ccccc1
: