Target
L-lactate dehydrogenase A chain
Ligand
BDBM50040086
Substrate
Meas. Tech.
ChEMBL_1443550 (CHEMBL3378383)
IC50
46000±n/a nM
Citation
 Fauber, BPDragovich, PSChen, JCorson, LBDing, CZEigenbrot, CLabadie, SMalek, SPeterson, DPurkey, HERobarge, KSideris, SUltsch, MWei, BYen, IYue, QZhou, A Identification of 3,6-disubstituted dihydropyrones as inhibitors of human lactate dehydrogenase. Bioorg Med Chem Lett 24:5683-7 (2014)  
Target
Name:
L-lactate dehydrogenase A chain
Synonyms:
Cell proliferation-inducing gene 19 protein L-lactate dehydrogenase A Chain LDH-A LDHA Lactate dehydrogenase A (LDHA) | Renal carcinoma antigen NY-REN-59
Type:
Protein
Mol. Mass.:
36694.85
Organism:
Homo sapiens (Human)
Description:
P00338::PDB Code: 4ajp
Residue:
332
  
Inhibitor
Name:
BDBM50040086
Synonyms:
CHEMBL3352887
Type:
Small organic molecule
Emp. Form.:
C18H13ClO5S
Mol. Mass.:
376.811
SMILES:
OC(=O)C1(CC(O)=C(Sc2ccccc2Cl)C(=O)O1)c1ccccc1
: