Target
Sodium-dependent serotonin transporter
Ligand
BDBM50040256
Substrate
Meas. Tech.
ChEMBL_1443751 (CHEMBL3371724)
Ki
468±n/a nM
Citation
 Xu, RLord, SAPeterson, RMFergason-Cantrell, EALever, JRLever, SZ Ether modifications to 1-[2-(3,4-dimethoxyphenyl)ethyl]-4-(3-phenylpropyl)piperazine (SA4503): effects on binding affinity and selectivity for sigma receptors and monoamine transporters. Bioorg Med Chem 23:222-30 (2014)  
Target
Name:
Sodium-dependent serotonin transporter
Synonyms:
5-HT Transporter 5HTT SC6A4_MOUSE Sert Sodium-dependent serotonin transporter | Solute carrier family 6 member 4
Type:
Enzyme Catalytic Domain
Mol. Mass.:
70044.92
Organism:
MOUSE
Description:
5-HT Transporter SLC6A4 MOUSE::Q60857
Residue:
630
  
Inhibitor
Name:
BDBM50040256
Synonyms:
CHEMBL3352893
Type:
Small organic molecule
Emp. Form.:
C22H28N2O2
Mol. Mass.:
352.4699
SMILES:
C(CN1CCN(CCc2ccc3OCOc3c2)CC1)Cc1ccccc1
: