Target
Sodium-dependent serotonin transporter
Ligand
BDBM22165
Substrate
Meas. Tech.
ChEMBL_1443751 (CHEMBL3371724)
Ki
24±n/a nM
Citation
 Xu, RLord, SAPeterson, RMFergason-Cantrell, EALever, JRLever, SZ Ether modifications to 1-[2-(3,4-dimethoxyphenyl)ethyl]-4-(3-phenylpropyl)piperazine (SA4503): effects on binding affinity and selectivity for sigma receptors and monoamine transporters. Bioorg Med Chem 23:222-30 (2014)  
Target
Name:
Sodium-dependent serotonin transporter
Synonyms:
5-HT Transporter 5HTT SC6A4_MOUSE Sert Sodium-dependent serotonin transporter | Solute carrier family 6 member 4
Type:
Enzyme Catalytic Domain
Mol. Mass.:
70044.92
Organism:
MOUSE
Description:
5-HT Transporter SLC6A4 MOUSE::Q60857
Residue:
630
  
Inhibitor
Name:
BDBM22165
Synonyms:
1-{2-[bis(4-fluorophenyl)methoxy]ethyl}-4-(3-phenylpropyl)piperazine CHEMBL281594 CHEMBL543876 GBR-12909 US9944618, Compound ID No. 175 | Vanoxerine
Type:
Small organic molecule
Emp. Form.:
C28H32F2N2O
Mol. Mass.:
450.5633
SMILES:
Fc1ccc(cc1)C(OCCN1CCN(CCCc2ccccc2)CC1)c1ccc(F)cc1
: