Target
Bombesin receptor subtype-3
Ligand
BDBM50041423
Substrate
Meas. Tech.
ChEMBL_1445901 (CHEMBL3377328)
EC50
4.2±n/a nM
Citation
 Matsufuji, TShimada, KKobayashi, SIchikawa, MKawamura, AFujimoto, TArita, THara, TKonishi, MAbe-Ohya, RIzumi, MSogawa, YNagai, YYoshida, KAbe, YKimura, TTakahashi, H Synthesis and biological evaluation of novel chiral diazepine derivatives as bombesin receptor subtype-3 (BRS-3) agonists incorporating an antedrug approach. Bioorg Med Chem 23:89-104 (2014)  
Target
Name:
Bombesin receptor subtype-3
Synonyms:
BRS-3 BRS3_HUMAN Bombesin like receptor 3
Type:
Enzyme Catalytic Domain
Mol. Mass.:
44424.45
Organism:
Homo sapiens (Human)
Description:
Bombesin 3 BRS3 HUMAN::P32247
Residue:
399
  
Inhibitor
Name:
BDBM50041423
Synonyms:
CHEMBL3356410
Type:
Small organic molecule
Emp. Form.:
C24H26F3N3O5
Mol. Mass.:
493.4755
SMILES:
CC(C)COC(=O)c1cccc(CC(=O)N2CCNc3nc(ccc3[C@H]2CC(O)=O)C(F)(F)F)c1
: