Target
Serine/threonine-protein kinase Chk1
Ligand
BDBM50043403
Substrate
Meas. Tech.
ChEMBL_1444991 (CHEMBL3372399)
EC50
3300±n/a nM
Citation
 Barsanti, PAPan, YLu, YJain, RCox, MAversa, RJDillon, MPElling, RHu, CJin, XKnapp, MLan, JRamurthy, SRudewicz, PSetti, LSubramanian, SMathur, MTaricani, LThomas, GXiao, LYue, Q Structure-Based Drug Design of Novel, Potent, and Selective Azabenzimidazoles (ABI) as ATR Inhibitors. ACS Med Chem Lett 6:42-6 (2015)  
Target
Name:
Serine/threonine-protein kinase Chk1
Synonyms:
CHEK1 CHK1 checkpoint homolog Checkpoint kinase-1 (CHK1)
Type:
Enzyme Catalytic Domain
Mol. Mass.:
54443.02
Organism:
Homo sapiens (Human)
Description:
gi_166295192
Residue:
476
  
Inhibitor
Name:
BDBM50043403
Synonyms:
CHEMBL3355472
Type:
Small organic molecule
Emp. Form.:
C20H21N5O3S
Mol. Mass.:
411.477
SMILES:
CS(=O)(=O)Cn1cnc2c(nc(cc12)-c1cccc2[nH]ccc12)N1CCOCC1
: