Target
Serine/threonine-protein kinase ATR
Ligand
BDBM50043403
Substrate
Meas. Tech.
ChEMBL_1444990 (CHEMBL3372398)
IC50
5.0±n/a nM
Citation
 Barsanti, PAPan, YLu, YJain, RCox, MAversa, RJDillon, MPElling, RHu, CJin, XKnapp, MLan, JRamurthy, SRudewicz, PSetti, LSubramanian, SMathur, MTaricani, LThomas, GXiao, LYue, Q Structure-Based Drug Design of Novel, Potent, and Selective Azabenzimidazoles (ABI) as ATR Inhibitors. ACS Med Chem Lett 6:42-6 (2015)  
Target
Name:
Serine/threonine-protein kinase ATR
Synonyms:
ATR Ataxia telangiectasia and Rad3-related protein (ATR) FRP1 | Serine-protein kinase ATR
Type:
Protein
Mol. Mass.:
301404.58
Organism:
Homo sapiens (Human)
Description:
Q13535
Residue:
2644
  
Inhibitor
Name:
BDBM50043403
Synonyms:
CHEMBL3355472
Type:
Small organic molecule
Emp. Form.:
C20H21N5O3S
Mol. Mass.:
411.477
SMILES:
CS(=O)(=O)Cn1cnc2c(nc(cc12)-c1cccc2[nH]ccc12)N1CCOCC1
: