Target
LIM domain kinase 2
Ligand
BDBM50043631
Substrate
Meas. Tech.
ChEMBL_1445025 (CHEMBL3372433)
IC50
52±n/a nM
Citation
 Goodwin, NCCianchetta, GBurgoon, HAHealy, JMabon, RStrobel, EDAllen, JWang, SHamman, BDRawlins, DB Discovery of a Type III Inhibitor of LIM Kinase 2 That Binds in a DFG-Out Conformation. ACS Med Chem Lett 6:53-7 (2015)  
Target
Name:
LIM domain kinase 2
Synonyms:
LIMK2 | LIMK2_HUMAN
Type:
PROTEIN
Mol. Mass.:
72238.81
Organism:
Homo sapiens (Human)
Description:
ChEMBL_1514398
Residue:
638
  
Inhibitor
Name:
BDBM50043631
Synonyms:
CHEMBL3355483
Type:
Small organic molecule
Emp. Form.:
C21H19FN2O3S
Mol. Mass.:
398.451
SMILES:
CN(Cc1ccccc1)C(=O)c1ccc(cc1)S(=O)(=O)Nc1ccccc1F
: