Target
Neuronal acetylcholine receptor subunit alpha-7
Ligand
BDBM50045046
Substrate
Meas. Tech.
ChEMBL_1453578 (CHEMBL3363163)
IC50
1600±n/a nM
Citation
 Yu, LFZhang, HKCaldarone, BJEaton, JBLukas, RJKozikowski, AP Recent developments in novel antidepressants targetinga4ß2-nicotinic acetylcholine receptors. J Med Chem 57:8204-23 (2014)  
Target
Name:
Neuronal acetylcholine receptor subunit alpha-7
Synonyms:
ACHA7_HUMAN Cholinergic, Nicotinic Alpha7 Neuronal acetylcholine receptor protein alpha-7 subunit Nicotinic acetylcholine receptor alpha-7 (alpha7 nAChR)
Type:
Mol. Mass.:
56448.33
Organism:
Homo sapiens (Human)
Description:
CHRNA7 (NACHRA7)
Residue:
502
  
Inhibitor
Name:
BDBM50045046
Synonyms:
CHEMBL3341962
Type:
Small organic molecule
Emp. Form.:
C11H21N
Mol. Mass.:
167.2911
SMILES:
[H][C@@]12CC[C@@]([H])(C1)C(C)(NC)C2(C)C
: