Target
Acetylcholinesterase
Ligand
BDBM50045108
Substrate
Meas. Tech.
ChEMBL_1458076 (CHEMBL3367639)
IC50
2500±n/a nM
Citation
 Sukhorukov, AYNirvanappa, ACSwamy, JIoffe, SLNanjunda Swamy, SBasappa, naRangappa, KS Synthesis and characterization of novel 1,2-oxazine-based small molecules that targets acetylcholinesterase. Bioorg Med Chem Lett 24:3618-21 (2014)  
Target
Name:
Acetylcholinesterase
Synonyms:
ACES_HUMAN Acetylcholinesterase (AChE) | Acetylcholinesterase (human AChE)
Type:
Enzyme
Mol. Mass.:
67792.70
Organism:
Homo sapiens (Human)
Description:
P22303
Residue:
614
  
Inhibitor
Name:
BDBM50045108
Synonyms:
CHEMBL3310703
Type:
Small organic molecule
Emp. Form.:
C23H22N2O4
Mol. Mass.:
390.4318
SMILES:
CC(=O)N1OC(C)(C)CC(=C1CN1C(=O)c2ccccc2C1=O)c1ccccc1
: