Target
Acetylcholinesterase
Ligand
BDBM50045110
Substrate
Meas. Tech.
ChEMBL_1458076 (CHEMBL3367639)
IC50
12000±n/a nM
Citation
 Sukhorukov, AYNirvanappa, ACSwamy, JIoffe, SLNanjunda Swamy, SBasappa, naRangappa, KS Synthesis and characterization of novel 1,2-oxazine-based small molecules that targets acetylcholinesterase. Bioorg Med Chem Lett 24:3618-21 (2014)  
Target
Name:
Acetylcholinesterase
Synonyms:
ACES_HUMAN Acetylcholinesterase (AChE) | Acetylcholinesterase (human AChE)
Type:
Enzyme
Mol. Mass.:
67792.70
Organism:
Homo sapiens (Human)
Description:
P22303
Residue:
614
  
Inhibitor
Name:
BDBM50045110
Synonyms:
CHEMBL3310705
Type:
Small organic molecule
Emp. Form.:
C20H25NO6
Mol. Mass.:
375.4156
SMILES:
COC(=O)C(CC1=C(CC(C)(C)ON1C(C)=O)c1ccccc1)C(=O)OC
: