Target
Acetylcholinesterase
Ligand
BDBM50045112
Substrate
Meas. Tech.
ChEMBL_1458076 (CHEMBL3367639)
IC50
35120±n/a nM
Citation
 Sukhorukov, AYNirvanappa, ACSwamy, JIoffe, SLNanjunda Swamy, SBasappa, naRangappa, KS Synthesis and characterization of novel 1,2-oxazine-based small molecules that targets acetylcholinesterase. Bioorg Med Chem Lett 24:3618-21 (2014)  
Target
Name:
Acetylcholinesterase
Synonyms:
ACES_HUMAN Acetylcholinesterase (AChE) | Acetylcholinesterase (human AChE)
Type:
Enzyme
Mol. Mass.:
67792.70
Organism:
Homo sapiens (Human)
Description:
P22303
Residue:
614
  
Inhibitor
Name:
BDBM50045112
Synonyms:
CHEMBL3360757
Type:
Small organic molecule
Emp. Form.:
C17H21NO3
Mol. Mass.:
287.3535
SMILES:
[H][C@@]12CCCC[C@]1([H])[C@H](C(CC(=O)OC)=NO2)c1ccccc1
: