Target
Acetylcholinesterase
Ligand
BDBM50045180
Substrate
Meas. Tech.
ChEMBL_1458076 (CHEMBL3367639)
IC50
65320±n/a nM
Citation
 Sukhorukov, AYNirvanappa, ACSwamy, JIoffe, SLNanjunda Swamy, SBasappa, naRangappa, KS Synthesis and characterization of novel 1,2-oxazine-based small molecules that targets acetylcholinesterase. Bioorg Med Chem Lett 24:3618-21 (2014)  
Target
Name:
Acetylcholinesterase
Synonyms:
ACES_HUMAN Acetylcholinesterase (AChE) | Acetylcholinesterase (human AChE)
Type:
Enzyme
Mol. Mass.:
67792.70
Organism:
Homo sapiens (Human)
Description:
P22303
Residue:
614
  
Inhibitor
Name:
BDBM50045180
Synonyms:
CHEMBL3310697
Type:
Small organic molecule
Emp. Form.:
C21H20N2O3
Mol. Mass.:
348.3951
SMILES:
CC1(C)C[C@H](C(CN2C(=O)c3ccccc3C2=O)=NO1)c1ccccc1
: