Target
Transient receptor potential cation channel subfamily V member 1
Ligand
BDBM50046366
Substrate
Meas. Tech.
ChEMBL_1447592 (CHEMBL3373787)
Ki
0.200000±n/a nM
Citation
 Ryu, HSeo, SCho, SHKim, HSJung, AKang, DWSon, KCui, MHong, SHSharma, PKChoi, SBlumberg, PMFrank-Foltyn, RBahrenberg, GStockhausen, HSchiene, KChristoph, TFrormann, SLee, J 2-Alkyl/alkenyl substituted pyridine C-region analogues of 2-(3-fluoro-4-methylsulfonylaminophenyl)propanamides as highly potent TRPV1 antagonists. Bioorg Med Chem Lett 24:4039-43 (2014)  
Target
Name:
Transient receptor potential cation channel subfamily V member 1
Synonyms:
Capsaicin receptor Osm-9-like TRP channel 1 TRPV1_HUMAN Transient receptor potential cation channel subfamily V member 1 (TRPV1) Transient receptor potential cation channel subfamily V member 1(TRPV1) Vanilloid VR1 Vanilloid receptor 1 Vanilloid receptor 1 (VRI/TRPV1)
Type:
Protein
Mol. Mass.:
94960.75
Organism:
Homo sapiens (Human)
Description:
Q8NER1
Residue:
839
  
Inhibitor
Name:
BDBM50046366
Synonyms:
CHEMBL3314404
Type:
Small organic molecule
Emp. Form.:
C24H27F4N3O3S
Mol. Mass.:
513.548
SMILES:
C[C@H](C(=O)NCc1ccc(nc1C1=CCC(C)CC1)C(F)(F)F)c1ccc(NS(C)(=O)=O)c(F)c1
: