Target
Transient receptor potential cation channel subfamily A member 1
Ligand
BDBM50046740
Substrate
Meas. Tech.
ChEMBL_1451906 (CHEMBL3363076)
EC50
>40000±n/a nM
Citation
 Copeland, KWBoezio, AACheung, ELee, JOlivieri, PSchenkel, LBWan, QWang, WWells, MCYoungblood, BGavva, NRLehto, SGGeuns-Meyer, S Development of novel azabenzofuran TRPA1 antagonists as in vivo tools. Bioorg Med Chem Lett 24:3464-8 (2014)  
Target
Name:
Transient receptor potential cation channel subfamily A member 1
Synonyms:
Anktm1 Trpa1
Type:
PROTEIN
Mol. Mass.:
128622.74
Organism:
Rattus norvegicus
Description:
ChEMBL_1450487
Residue:
1125
  
Inhibitor
Name:
BDBM50046740
Synonyms:
CHEMBL1939972 | US9186360, 90
Type:
Small organic molecule
Emp. Form.:
C21H20N2O3S
Mol. Mass.:
380.46
SMILES:
COCCCOc1cccc(c1)C1NC(=S)NC2=C1C(=O)c1ccccc21
: