Target
Transient receptor potential cation channel subfamily A member 1
Ligand
BDBM50046740
Substrate
Meas. Tech.
ChEMBL_1451904 (CHEMBL3363074)
IC50
30±n/a nM
Citation
 Copeland, KWBoezio, AACheung, ELee, JOlivieri, PSchenkel, LBWan, QWang, WWells, MCYoungblood, BGavva, NRLehto, SGGeuns-Meyer, S Development of novel azabenzofuran TRPA1 antagonists as in vivo tools. Bioorg Med Chem Lett 24:3464-8 (2014)  
Target
Name:
Transient receptor potential cation channel subfamily A member 1
Synonyms:
ANKTM1 TRPA1 Transformation-sensitive protein p120 | Transient receptor potential cation channel subfamily A member 1 (TRPA1)
Type:
Protein
Mol. Mass.:
127514.20
Organism:
Homo sapiens (Human)
Description:
O75762
Residue:
1119
  
Inhibitor
Name:
BDBM50046740
Synonyms:
CHEMBL1939972 | US9186360, 90
Type:
Small organic molecule
Emp. Form.:
C21H20N2O3S
Mol. Mass.:
380.46
SMILES:
COCCCOc1cccc(c1)C1NC(=S)NC2=C1C(=O)c1ccccc21
: