Target
Peroxisome proliferator-activated receptor gamma
Ligand
BDBM23411
Substrate
Meas. Tech.
ChEMBL_1453700 (CHEMBL3364102)
EC50
16400±n/a nM
Citation
 Liu, QYang, QMHu, HJYang, LYang, YBChou, GXWang, ZT Bioactive diterpenoids and flavonoids from the aerial parts of Scoparia dulcis. J Nat Prod 77:1594-600 (2014)  
Target
Name:
Peroxisome proliferator-activated receptor gamma
Synonyms:
Nr1c3 PPAR-gamma Pparg
Type:
PROTEIN
Mol. Mass.:
57593.55
Organism:
Mus musculus
Description:
ChEMBL_1453700
Residue:
505
  
Inhibitor
Name:
BDBM23411
Synonyms:
5,6,7-trihydroxy-2-(4-hydroxyphenyl)-4H-chromen-4-one Scutellarein Scutellarein (28) | US10252984, Table 2.2
Type:
flavone
Emp. Form.:
C15H10O6
Mol. Mass.:
286.2363
SMILES:
Oc1ccc(cc1)-c1cc(=O)c2c(O)c(O)c(O)cc2o1
: