Target
Metabotropic glutamate receptor 5
Ligand
BDBM50047902
Substrate
Meas. Tech.
ChEMBL_1451942 (CHEMBL3363386)
IC50
>10000±n/a nM
Citation
 Bates, BSRodriguez, ALFelts, ASMorrison, RDVenable, DFBlobaum, ALByers, FWLawson, KPDaniels, JSNiswender, CMJones, CKConn, PJLindsley, CWEmmitte, KA Discovery of VU0431316: a negative allosteric modulator of mGlu5 with activity in a mouse model of anxiety. Bioorg Med Chem Lett 24:3307-14 (2014)  
Target
Name:
Metabotropic glutamate receptor 5
Synonyms:
GRM5_RAT Grm5 Mglur5 metabotropic glutamate 5/1-C metabotropic glutamate 5a
Type:
Enzyme
Mol. Mass.:
131900.14
Organism:
Rattus norvegicus (Rat)
Description:
P31424
Residue:
1203
  
Inhibitor
Name:
BDBM50047902
Synonyms:
CHEMBL3314826
Type:
Small organic molecule
Emp. Form.:
C16H9ClF2N4O2
Mol. Mass.:
362.718
SMILES:
Fc1cncc(Oc2cncc(NC(=O)c3cc(F)cc(Cl)c3)n2)c1
: