Target
Angiotensin-converting enzyme
Ligand
BDBM50348866
Substrate
Meas. Tech.
ChEMBL_1454785 (CHEMBL3363246)
IC50
416000000±n/a nM
Citation
 Wu, SQi, WSu, RLi, TLu, DHe, Z CoMFA and CoMSIA analysis of ACE-inhibitory, antimicrobial and bitter-tasting peptides. Eur J Med Chem 84:100-6 (2014)  
Target
Name:
Angiotensin-converting enzyme
Synonyms:
ACE Angiotensin converting enzyme (ACE) Angiotensin-converting enzyme, soluble form CD_antigen=CD143 DCP1 Kininase II
Type:
Enzyme
Mol. Mass.:
149709.01
Organism:
Homo sapiens (Human)
Description:
Residue:
1306
  
Inhibitor
Name:
BDBM50348866
Synonyms:
CHEMBL439762
Type:
Small organic molecule
Emp. Form.:
C10H18N2O3
Mol. Mass.:
214.2615
SMILES:
CC(C)[C@H](N)C(=O)N1CCC[C@H]1C(O)=O
: