Target
Angiotensin-converting enzyme
Ligand
BDBM50049835
Substrate
Meas. Tech.
ChEMBL_1454785 (CHEMBL3363246)
IC50
2180000±n/a nM
Citation
 Wu, SQi, WSu, RLi, TLu, DHe, Z CoMFA and CoMSIA analysis of ACE-inhibitory, antimicrobial and bitter-tasting peptides. Eur J Med Chem 84:100-6 (2014)  
Target
Name:
Angiotensin-converting enzyme
Synonyms:
ACE Angiotensin converting enzyme (ACE) Angiotensin-converting enzyme, soluble form CD_antigen=CD143 DCP1 Kininase II
Type:
Enzyme
Mol. Mass.:
149709.01
Organism:
Homo sapiens (Human)
Description:
Residue:
1306
  
Inhibitor
Name:
BDBM50049835
Synonyms:
CHEMBL3322120
Type:
Small organic molecule
Emp. Form.:
C29H46N6O7
Mol. Mass.:
590.7115
SMILES:
CC[C@H](C)[C@H](N)C(=O)N[C@@H](C)C(=O)N[C@@H](Cc1ccc(O)cc1)C(=O)N[C@@H](CCCCN)C(=O)N1CCC[C@H]1C(O)=O
: