Target
Cholinesterase
Ligand
BDBM50050566
Substrate
Meas. Tech.
ChEMBL_1458378 (CHEMBL3369808)
IC50
10500±n/a nM
Citation
 Alza, NPRichmond, VBaier, CJFreire, EBaggio, RMurray, AP Synthesis and cholinesterase inhibition of cativic acid derivatives. Bioorg Med Chem 22:3838-49 (2014)  
Target
Name:
Cholinesterase
Synonyms:
BCHE CHLE_HORSE | Cholinesterase
Type:
Enzyme
Mol. Mass.:
65643.35
Organism:
Equus caballus (Horse)
Description:
P81908
Residue:
574
  
Inhibitor
Name:
BDBM50050566
Synonyms:
CHEMBL3309346
Type:
Small organic molecule
Emp. Form.:
C31H55NO3
Mol. Mass.:
489.7733
SMILES:
[H][C@@]12CC=C(CO)[C@H](CC[C@H](C)CC(=O)OCCCCCCN3CCCCC3)[C@@]1(C)CCCC2(C)C
: